Can some one please point me where could be the problem.
Python version 3.9.2
When I try to make at the end I got trouble image missing /media/kunena/emoticons/dizzy.png
/usr/bin/ld: ../lib/librs274.so.0: undefined reference to `boost::python::detail::exception_handler::operator()(boost::function0<void> const&) const'
/usr/bin/ld: ../lib/librs274.so.0: undefined reference to `boost::python::import(boost::python::str)'
/usr/bin/ld: ../lib/librs274.so.0: undefined reference to `boost::python::objects::identity_function()'
/usr/bin/ld: ../lib/librs274.so.0: undefined reference to `boost::python::api::setitem(boost::python::api::object const&, boost::python::api::object const&, boost::python::api::object const&)'
/usr/bin/ld: ../lib/librs274.so.0: undefined reference to `boost::python::detail::list_base::append(boost::python::api::object const&)'
/usr/bin/ld: ../lib/librs274.so.0: undefined reference to `boost::python::objects::stop_iteration_error()'
/usr/bin/ld: ../lib/libpyplugin.so.0: undefined reference to `boost::python::exec_file(char const*, boost::python::api::object, boost::python::api::object)'
/usr/bin/ld: ../lib/librs274.so.0: undefined reference to `boost::python::converter::rvalue_from_python_stage2(_object*, boost::python::converter::rvalue_from_python_stage1_data&, boost::python::converter::registration const&)'
/usr/bin/ld: ../lib/librs274.so.0: undefined reference to `boost::python::detail::dict_base::keys() const'
/usr/bin/ld: ../lib/librs274.so.0: undefined reference to `boost::python::detail::list_base::extend(boost::python::api::object const&)'
/usr/bin/ld: ../lib/librs274.so.0: undefined reference to `boost::python::handle_exception_impl(boost::function0<void>)'
/usr/bin/ld: ../lib/librs274.so.0: undefined reference to `boost::python::detail::list_base::list_base()'
/usr/bin/ld: ../lib/librs274.so.0: undefined reference to `boost::python::detail::register_exception_handler(boost::function2<bool, boost::python::detail::exception_handler const&, boost::function0<void> const&> const&)'
/usr/bin/ld: ../lib/librs274.so.0: undefined reference to `boost::python::detail::str_base::str_base(boost::python::api::object const&)'
/usr/bin/ld: ../lib/librs274.so.0: undefined reference to `boost::python::detail::str_base::join(boost::python::api::object const&) const'
/usr/bin/ld: ../lib/librs274.so.0: undefined reference to `boost::python::objects::enum_base::export_values()'
/usr/bin/ld: ../lib/librs274.so.0: undefined reference to `boost::python::api::operator%(boost::python::api::object const&, boost::python::api::object const&)'
/usr/bin/ld: ../lib/librs274.so.0: undefined reference to `boost::python::converter::throw_no_reference_from_python(_object*, boost::python::converter::registration const&)'
/usr/bin/ld: ../lib/librs274.so.0: undefined reference to `boost::python::detail::str_base::str_base(char const*)'
/usr/bin/ld: ../lib/librs274.so.0: undefined reference to `boost::python::pytype_check(_typeobject*, _object*)'
/usr/bin/ld: ../lib/libpyplugin.so.0: undefined reference to `boost::python::exec(char const*, boost::python::api::object, boost::python::api::object)'
/usr/bin/ld: ../lib/librs274.so.0: undefined reference to `boost::python::api::operator+(boost::python::api::object const&, boost::python::api::object const&)'
/usr/bin/ld: ../lib/librs274.so.0: undefined reference to `boost::python::detail::tuple_base::tuple_base(boost::python::api::object const&)'
collect2: error: ld returned 1 exit status
make: *** [emc/sai/Submakefile:12: ../bin/rs274] Error 1
make: *** Waiting for unfinished jobs....
/usr/bin/ld: objects/emc/task/taskclass.o: in function `boost::python::converter::arg_to_python<char const*>::arg_to_python(char const* const&)':
/usr/include/boost/python/converter/builtin_converters.hpp:157: undefined reference to `boost::python::converter::do_return_to_python(char const*)'
/usr/bin/ld: objects/emc/task/taskclass.o: in function `boost::python::dict::dict()':
/usr/include/boost/python/dict.hpp:89: undefined reference to `boost::python::detail::dict_base::dict_base()'
/usr/bin/ld: objects/emc/task/taskclass.o: in function `_object* boost::python::expect_non_null<_object>(_object*)':
/usr/include/boost/python/errors.hpp:45: undefined reference to `boost::python::throw_error_already_set()'
/usr/bin/ld: /usr/include/boost/python/errors.hpp:45: undefined reference to `boost::python::throw_error_already_set()'
/usr/bin/ld: objects/emc/task/taskclass.o: in function `boost::python::converter::arg_to_python<char const*>::arg_to_python(char const* const&)':
/usr/include/boost/python/converter/builtin_converters.hpp:157: undefined reference to `boost::python::converter::do_return_to_python(char const*)'
/usr/bin/ld: objects/emc/task/taskclass.o: in function `boost::python::api::const_item_policies::get(boost::python::api::object const&, boost::python::api::object const&)':
/usr/include/boost/python/object_items.hpp:65: undefined reference to `boost::python::api::getitem(boost::python::api::object const&, boost::python::api::object const&)'
/usr/bin/ld: objects/emc/task/taskclass.o: in function `boost::python::api::const_attribute_policies::get(boost::python::api::object const&, char const*)':
/usr/include/boost/python/object_attributes.hpp:74: undefined reference to `boost::python::api::getattr(boost::python::api::object const&, char const*)'
/usr/bin/ld: objects/emc/task/taskclass.o: in function `boost::python::converter::arg_to_python<char const*>::arg_to_python(char const* const&)':
/usr/include/boost/python/converter/builtin_converters.hpp:157: undefined reference to `boost::python::converter::do_return_to_python(char const*)'
/usr/bin/ld: objects/emc/task/taskclass.o: in function `boost::python::api::const_item_policies::get(boost::python::api::object const&, boost::python::api::object const&)':
/usr/include/boost/python/object_items.hpp:65: undefined reference to `boost::python::api::getitem(boost::python::api::object const&, boost::python::api::object const&)'
/usr/bin/ld: objects/emc/task/taskclass.o: in function `boost::python::converter::extract_pointer<Task*>::extract_pointer(_object*)':
/usr/include/boost/python/extract.hpp:216: undefined reference to `boost::python::converter::get_lvalue_from_python(_object*, boost::python::converter::registration const&)'
/usr/bin/ld: /usr/include/boost/python/extract.hpp:216: undefined reference to `boost::python::converter::get_lvalue_from_python(_object*, boost::python::converter::registration const&)'
/usr/bin/ld: objects/emc/task/taskclass.o: in function `boost::python::converter::extract_pointer<Task*>::operator()() const':
/usr/include/boost/python/extract.hpp:231: undefined reference to `boost::python::converter::throw_no_pointer_from_python(_object*, boost::python::converter::registration const&)'
/usr/bin/ld: objects/emc/task/taskclass.o: in function `_object* boost::python::expect_non_null<_object>(_object*)':
/usr/include/boost/python/errors.hpp:45: undefined reference to `boost::python::throw_error_already_set()'
/usr/bin/ld: /usr/include/boost/python/errors.hpp:45: undefined reference to `boost::python::throw_error_already_set()'
/usr/bin/ld: objects/emc/task/taskclass.o:(.ARM.extab+0xb0): undefined reference to `typeinfo for boost::python::error_already_set'
/usr/bin/ld: objects/emc/task/taskclass.o:(.ARM.extab+0x200): undefined reference to `typeinfo for boost::python::error_already_set'
/usr/bin/ld: objects/emc/task/taskclass.o: in function `boost::python::converter::registration const& boost::python::converter::detail::registry_lookup2<Task const volatile>(Task const volatile& (*)())':
/usr/include/boost/python/converter/registered.hpp:100: undefined reference to `boost::python::converter::registry::lookup(boost::python::type_info)'
/usr/bin/ld: ../lib/librs274.so.0: undefined reference to `boost::python::detail::exception_handler::operator()(boost::function0<void> const&) const'
/usr/bin/ld: ../lib/librs274.so.0: undefined reference to `boost::python::import(boost::python::str)'
/usr/bin/ld: ../lib/librs274.so.0: undefined reference to `boost::python::objects::identity_function()'
/usr/bin/ld: ../lib/librs274.so.0: undefined reference to `boost::python::api::setitem(boost::python::api::object const&, boost::python::api::object const&, boost::python::api::object const&)'
/usr/bin/ld: ../lib/librs274.so.0: undefined reference to `boost::python::detail::list_base::append(boost::python::api::object const&)'
/usr/bin/ld: ../lib/librs274.so.0: undefined reference to `boost::python::objects::stop_iteration_error()'
/usr/bin/ld: ../lib/libpyplugin.so.0: undefined reference to `boost::python::exec_file(char const*, boost::python::api::object, boost::python::api::object)'
/usr/bin/ld: ../lib/librs274.so.0: undefined reference to `boost::python::converter::rvalue_from_python_stage2(_object*, boost::python::converter::rvalue_from_python_stage1_data&, boost::python::converter::registration const&)'
/usr/bin/ld: ../lib/librs274.so.0: undefined reference to `boost::python::detail::dict_base::keys() const'
/usr/bin/ld: ../lib/librs274.so.0: undefined reference to `boost::python::detail::list_base::extend(boost::python::api::object const&)'
/usr/bin/ld: ../lib/librs274.so.0: undefined reference to `boost::python::handle_exception_impl(boost::function0<void>)'
/usr/bin/ld: ../lib/librs274.so.0: undefined reference to `boost::python::detail::list_base::list_base()'
/usr/bin/ld: ../lib/librs274.so.0: undefined reference to `boost::python::detail::register_exception_handler(boost::function2<bool, boost::python::detail::exception_handler const&, boost::function0<void> const&> const&)'
/usr/bin/ld: ../lib/librs274.so.0: undefined reference to `boost::python::detail::str_base::str_base(boost::python::api::object const&)'
/usr/bin/ld: ../lib/librs274.so.0: undefined reference to `boost::python::detail::str_base::join(boost::python::api::object const&) const'
/usr/bin/ld: ../lib/librs274.so.0: undefined reference to `boost::python::objects::enum_base::export_values()'
/usr/bin/ld: ../lib/librs274.so.0: undefined reference to `boost::python::api::operator%(boost::python::api::object const&, boost::python::api::object const&)'
/usr/bin/ld: ../lib/librs274.so.0: undefined reference to `boost::python::converter::throw_no_reference_from_python(_object*, boost::python::converter::registration const&)'
/usr/bin/ld: ../lib/librs274.so.0: undefined reference to `boost::python::detail::str_base::str_base(char const*)'
/usr/bin/ld: ../lib/librs274.so.0: undefined reference to `boost::python::pytype_check(_typeobject*, _object*)'
/usr/bin/ld: ../lib/libpyplugin.so.0: undefined reference to `boost::python::exec(char const*, boost::python::api::object, boost::python::api::object)'
/usr/bin/ld: ../lib/librs274.so.0: undefined reference to `boost::python::api::operator+(boost::python::api::object const&, boost::python::api::object const&)'
/usr/bin/ld: ../lib/librs274.so.0: undefined reference to `boost::python::detail::tuple_base::tuple_base(boost::python::api::object const&)'
collect2: error: ld returned 1 exit status
make: *** [emc/task/Submakefile:37: ../bin/milltask] Error 1